Speciale bibliotheken
type: Concept
editorial note: -PV
main entity of page: https://koninklijkebibliotheek.triply.cc/.well-known/genid/000206d7e3f6383abe8456aa0aa471e9
main entity of page: http://data.bibliotheken.nl/doc/thes/p078670586
broader: p078452716
in scheme: gtt
preferred label: Special libraries @en
scope note: Zie ook de afzonderlijke soorten speciale bibliotheken, bijv. medische bibliotheken, muziekbibliotheken, jeugdbibliotheken