Sects
type: Concept
main entity of page: http://data.bibliotheken.nl/doc/thes/p078662532
main entity of page: https://koninklijkebibliotheek.triply.cc/.well-known/genid/fb934ac5f27ac3eb12e37056c18e81f0
in scheme: gtt
preferred label: Sekten @nl
related: p078523079
related: p078534089
related: p078558646
related: p078662524
scope note: Zie ook onder de namen van de diverse sekten en godsdienstige bewegingen.