Regionalisme (ideologie)
type: Concept
editorial note: GOO-thesaurusbeheer
editorial note: Op het gebied vanm taal, kleding, tradities enz.
editorial note: WP9
main entity of page: http://data.bibliotheken.nl/doc/thes/p078647754
main entity of page: https://koninklijkebibliotheek.triply.cc/.well-known/genid/e93402e3bb48003127ebba58337cc6de
in scheme: gtt
preferred label: Regionalism (ideology) @en
scope note: Het streven het eigene van een landstreek te behouden