Prevalentie
type: Concept
main entity of page: http://data.bibliotheken.nl/doc/thes/p078635454
main entity of page: https://koninklijkebibliotheek.triply.cc/.well-known/genid/d55b57967742b686cf0851a381b62d68
in scheme: gtt
preferred label: Prevalence @en
scope note: Het aantal gevallen van een bepaalde ziekte, in een bepaald gebied, op een bepaald tijdstip.