Plafondschilderingen
type: Concept
main entity of page: http://data.bibliotheken.nl/doc/thes/p078628652
main entity of page: https://koninklijkebibliotheek.triply.cc/.well-known/genid/895cfcd7c9aee965c94b3ec5ae08d6b0
editorial note: Kunst-overleg GOO
in scheme: gtt
preferred label: Ceiling paintings @en
related: p122442547
related: p122443314
scope note: Onder andere gebruikt voor publicaties over het werk van afzonderlijke plafondschilders