DDR
type: Concept
main entity of page: http://data.bibliotheken.nl/doc/thes/p078613663
main entity of page: https://koninklijkebibliotheek.triply.cc/.well-known/genid/544ebd4d2876e5bbe4df87b1d8a0fddd
alternative label: Duitse Democratische Republiek
alternative label: Oost-Duitsland (DDR)
alternative label: Sowjetische Besatzungszone
editorial note: WP9, zie onder: onder Duitse Democratische Republiek
editorial note: -PV
editorial note: 1949-1990
in scheme: gtt
preferred label: GDR @en
related: p078613760
related: p07849043X
scope note: Voor de periode na 1990: zie "Oost-Duitsland (regio)" of de betreffende deelstaten
scope note: Hierbij het door de Sovjet-Unie bezette gedeelte van Duitsland in de periode 1945-1949