Miniaturen (handschriften)
type: Concept
main entity of page: http://data.bibliotheken.nl/doc/thes/p078592356
main entity of page: https://koninklijkebibliotheek.triply.cc/.well-known/genid/c313b287019b1805688adea02dcc7973
editorial note: BDI-terminolgie (1990)
in scheme: gtt
preferred label: Miniatures (manuscripts) @en
related: p078514649
scope note: Geschilderde voorstelling in een middeleeuws handschrift of vroege druk