Metallurgie
type: Concept
main entity of page: http://data.bibliotheken.nl/doc/thes/p078589142
main entity of page: https://koninklijkebibliotheek.triply.cc/.well-known/genid/b7545398a62f133aed72355b96d6c579
editorial note: -PV
editorial note: Het Engelse metallurgy is meeromvattend dan het Nederlandse metallurgie, vandaar deze 161
editorial note: WP9; Kluwer polytechnisch woordenboek
in scheme: gtt
preferred label: Metal engineering @en
related: p113086628
scope note: Winning van metaal uit ertsen en verwerkingstechnieken van metalen