Lijkbezorging
type: Concept
main entity of page: http://data.bibliotheken.nl/doc/thes/p078579643
main entity of page: https://koninklijkebibliotheek.triply.cc/.well-known/genid/924d45ac6bfe67fafb8c3ef9544a6404
editorial note: GOO-thesaurusbeheer
editorial note: VD13
in scheme: gtt
preferred label: Undertaking @en
related: p07848815X
related: p203959043
scope note: Het verzorgen van begrafenissen of crematies