Lezen
type: Concept
main entity of page: http://data.bibliotheken.nl/doc/thes/p078574331
main entity of page: https://koninklijkebibliotheek.triply.cc/.well-known/genid/2742c101d6b1e106062f397d2b0b6bf2
editorial note: GOO-thesaurusbeheer
in scheme: gtt
preferred label: Reading @en
related: p234980710
related: p078572088
scope note: Techniek van het lezen, lezen in zijn algemeenheid