Kruistochten
type: Concept
main entity of page: https://koninklijkebibliotheek.triply.cc/.well-known/genid/a359d8d552f23a8153a1b68a195573db
main entity of page: http://data.bibliotheken.nl/doc/thes/p078566460
editorial note: WP9; Enc. Br.
editorial note: GOO-thesaurusbeheer
in scheme: gtt
preferred label: Crusades @en
scope note: Expedities om het Heilige Land te bevrijden in de 12e en 13e eeuw