Verenigd Koninkrijk van Groot-Brittannië en Noord-Ierland
type: Concept
main entity of page: http://data.bibliotheken.nl/doc/thes/p078527112
main entity of page: https://koninklijkebibliotheek.triply.cc/.well-known/genid/68b284919a3e2e166af473455d798fd4
alternative label: Great Britain @en
alternative label: Britannia
alternative label: Brittannië
alternative label: Groot-Brittannië
alternative label: UK
alternative label: United Kingdom
broader: p078459893
editorial note: -PV
editorial note: Lijst van landnamen / Werkgroep buitenlandse aardrijkskundige namen. - 1993 / WP9
in scheme: gtt
preferred label: United Kingdom of Great Britain and Northern Ireland @en
scope note: Omvat HET GEHEEL VAN Engeland, Wales, Schotland en Noord-Ierland