Granulopenie
type: Concept
main entity of page: https://koninklijkebibliotheek.triply.cc/.well-known/genid/ce82e1179fc907e27956191abbef9db4
main entity of page: http://data.bibliotheken.nl/doc/thes/p078525160
alternative label: Agranulocytose
alternative label: Granulocytopenie
in scheme: gtt
scope note: Het ontbreken van witte bloedlichaampjes.