Dodenbezorging
type: Concept
main entity of page: http://data.bibliotheken.nl/doc/thes/p07848815X
main entity of page: https://koninklijkebibliotheek.triply.cc/.well-known/genid/46ba144e4c616366b7bae367452dd949
alternative label: Grafrituelen
editorial note: GOO-thesaurusbeheer/-PV
editorial note: Nederlandse Larousse
in scheme: gtt
preferred label: Disposal of the dead @en
related: p078579643
related: p171549104
scope note: Verzorging van het stoffelijk overschot en de gebruiken daarbij