Beden
type: Concept
main entity of page: https://koninklijkebibliotheek.triply.cc/.well-known/genid/cbe06a2d56a8af1d30670f2ae61417e7
main entity of page: http://data.bibliotheken.nl/doc/thes/p078445299
broader: p078447666
editorial note: GOO-thesaurusbeheer/-PV
editorial note: VD13
in scheme: gtt
scope note: Belastingen, die formeel door de landheer van de steden werden gevraagd