Bankgarantie
type: Concept
editorial note: VD13
editorial note: GOO-thesaurusbeheer
main entity of page: http://data.bibliotheken.nl/doc/thes/p078444047
main entity of page: https://koninklijkebibliotheek.triply.cc/.well-known/genid/5896db370cb2946c571bc52c99068169
in scheme: gtt
preferred label: Bank guarantee @en
scope note: Borgstelling die een bank aan een cliënt geeft