Aquarellen
type: Concept
main entity of page: http://data.bibliotheken.nl/doc/thes/p078435560
main entity of page: https://koninklijkebibliotheek.triply.cc/.well-known/genid/cddc8363a303f387ce1c19cdc9f05bef
alternative label: Waterverfschilderijen
editorial note: Kunst-overleg GOO/-PV
editorial note: Van Dale 12
in scheme: gtt
preferred label: Watercolors @en
related: p078524164
related: p12213737X
scope note: Onder andere gebruikt voor publicaties over het werk van afzonderlijke aquarellisten