Galápagos eilanden
type: Thing
type: Concept
main entity of page: https://data.bibliotheken.nl/.well-known/genid/4b98bcd368bc7d254aa2b956eb40fd9c
in scheme: brinkman
scope note: De Galapagoseilanden (kortweg Galapagos, Spaans: Islas Galápagos, officieel Archipiélago de Colón) zijn een verspreide groep eilanden ter hoogte van de evenaar in de Stille Oceaan