Stellingwerf
type: Thing
type: Concept
main entity of page: https://data.bibliotheken.nl/.well-known/genid/4acd6c6bbda439182a005af2370918e7
broader: p075630796
in scheme: brinkman
scope note: De Stellingwerven is een gebied in het oosten van Friesland, ten zuidoosten van de rivier de Tjonger, dat zich van de rest van de provincie onderscheidt doordat er voorheen voor een deel een andere taal dan het Fries werd gesproken. Tot de jaren zeventig van de vorige eeuw werd er een Nedersaksisch dialect, het Stellingwerfs, gesproken. Thans spreken de jongere generaties dit dialect nog nauwelijks. Bestuurlijk omvat de Stellingwerven de beide gemeenten Ooststellingwerf en Weststellingwerf. Landschappelijk vormt het met een aantal omliggende gebieden de Friese Wouden. In het grensgebied van Drenthe en Friesland ligt hier het Nationaal Park Drents-Friese Wold