Troje
type: Thing
type: Concept
main entity of page: https://data.bibliotheken.nl/.well-known/genid/497d188af166f49ba1b81cf5bb0a4469
broader: p075633825
in scheme: brinkman
scope note: De stad Troje (Grieks: Τροία, of Τροίη, Υρωΐα) / Ílion Ἴλιον; Latijn: Troia / Ilium; Turks: Truva; Hettitisch: Taruisa / Wilusha), het huidige Hisarlık) ligt in het noordwesten van het huidige Turkije aan de Dardanellen