Dollard
type: Thing
type: Concept
main entity of page: https://data.bibliotheken.nl/.well-known/genid/53de4e6475bade35affc74cd74e70a12
in scheme: brinkman
related match: (261.262)
scope note: De Dollard (Duits: Dollart, Gronings: Dollert of Dullert, bijnaam Olle Tjoard, Oostfries: Dullert, uitgesproken als Doelert) is een zeearm, onderdeel van de Waddenzee, op het grensgebied van Nederland en Duitsland