Middellandse Zeegebied
type: Thing
type: Concept
main entity of page: https://data.bibliotheken.nl/.well-known/genid/fc7429b090a9448091fc23182f2b5666
in scheme: brinkman
scope note: Het Middellandse Zeegebied is het gebied rond de Middellandse Zee, omvattende Spanje, Gibraltar, het zuiden van Frankrijk, Monaco, Italië, Malta, San Marino, het Vaticaan, Slovenië, Kroatië, Montenegro, Albanië, Bosnië en Herzegovina, Griekenland, Turkije, Cyprus, Syrië, Libanon, Israël, Palestina, Egypte, Libië, Tunesië, Algerije en Marokko