Brunei
type: Thing
type: Concept
main entity of page: https://data.bibliotheken.nl/.well-known/genid/e9fed7622f14185d57a66d214e04b226
in scheme: brinkman
related: p075666553
scope note: Brunei, officieel de Staat Brunei Darussalam (Maleis: Negara Brunei Darussalam), is een land in Zuidoost-Azië. Het ligt op het eiland Borneo aan de Zuid-Chinese Zee en wordt verder geheel omringd door Maleisië