Elzas
type: Thing
type: Concept
main entity of page: https://data.bibliotheken.nl/.well-known/genid/3e094e51cf7d7efe10137d454278f766
alternative label: Alsace
broader: p07563080X
in scheme: brinkman
scope note: De Elzas (Frans: Alsace, Duits: Elsass ) is een regio in het oosten van Frankrijk. De hoofdstad is Straatsburg