Italiaanse Rivièra
type: Thing
type: Concept
main entity of page: https://data.bibliotheken.nl/.well-known/genid/f5abde6911e4cd9b9ebf14778ce78732
broader: p075636352
in scheme: brinkman
scope note: De Italiaanse Rivièra is een deel van de kust van Italië die loopt van de grens met Frankrijk tot Toscane