Fiji
type: Thing
type: Concept
main entity of page: https://data.bibliotheken.nl/.well-known/genid/267e9e308879d947a917b7dc99f0d9a1
in scheme: brinkman
related match: (961.1)
scope note: Fiji, officieel de Republiek Fiji, is een land in Melanesië, in Oceanië op het zuidelijk halfrond. Het bestaat uit meer dan 332 eilanden waarvan er 106 bewoond zijn. De grootste zijn Viti Levu waarop de hoofdstad Suva ligt en Vanua Levu