Benin
type: Thing
type: Concept
main entity of page: https://data.bibliotheken.nl/.well-known/genid/ece59bff36046da4f4e3b95df5c67064
in scheme: brinkman
related match: 916.682
scope note: Benin, officieel de Republiek Benin, is een land in Afrika