Ninove
type: Thing
type: Concept
main entity of page: https://data.bibliotheken.nl/.well-known/genid/ab7c6691c612a83ef9c2ec67d6da57e5
broader: p075629720
in scheme: brinkman
scope note: Ninove is een stad in de Belgische provincie Oost-Vlaanderen. De stad ligt aan de Dender in de Denderstreek