Ursem
type: Thing
type: Concept
main entity of page: https://data.bibliotheken.nl/.well-known/genid/aadc7b1a260c7888a73c8f2cad180f62
broader: p075632861
in scheme: brinkman
scope note: Ursem is een dorp in de gemeenten Koggenland en Schermer, in de Nederlandse provincie Noord-Holland