Amstel
type: Thing
type: Concept
main entity of page: https://data.bibliotheken.nl/.well-known/genid/b74b3a096005c4b30916071af703fd1d
broader: p075632861
in scheme: brinkman
scope note: De Amstel (naar Aeme-stelle, een Oudnederlands woord voor "waterachtig gebied") is een gekanaliseerde rivier in het zuiden van Noord-Holland