Himalaya
type: Thing
type: Concept
main entity of page: https://data.bibliotheken.nl/.well-known/genid/6c594ae31e9f2a8f82061aed36f1aaf8
in scheme: brinkman
scope note: De Himalaya, ook wel Himalayagebergte of Himalaya's genoemd (Hindi/Nepali: हिमालय; Tibetaans: ཧི་མ་ལ་ཡ; Urdu: سلسلہ کوہ ہمالیہ; Chinees: 喜马拉雅山脉), is een gebergte in het zuiden van Azië