Mauritanië
type: Thing
type: Concept
main entity of page: https://data.bibliotheken.nl/.well-known/genid/6c2cdbd5fe7e5a4603ab8421df01099b
alternative label: Mauretanië
in scheme: brinkman
scope note: Mauritanië, officieel de Islamitische Republiek Mauritanië, is een land aan de westkust van Afrika, grenzend aan de Westelijke Sahara, Algerije, Mali, Senegal en de Atlantische Oceaan. Nouakchott is de hoofdstad en de grootste stad van het land