Madagascar
type: Thing
type: Concept
main entity of page: https://data.bibliotheken.nl/.well-known/genid/48a62da09c245d37578443b9f0a2bd9c
alternative label: Madagaskar
alternative label: Malagasi
in scheme: brinkman
related match: (691)
scope note: Madagaskar, ook wel Malagasi, officieel de Republiek Madagaskar, is een eiland en een land dat ten oosten van het vasteland van het continent Afrika ligt, ervan gescheiden door Straat Mozambique