Karinthië
type: Thing
type: Concept
main entity of page: https://data.bibliotheken.nl/.well-known/genid/0419d14736e1e513b645b5a324cbc2a8
broader: p075632993
in scheme: brinkman
scope note: Karinthië (Duits: Kärnten, Sloveens: Koroška, Beiers: Kärntn ofwel Karntn) is een deelstaat (Bundesland) van Oostenrijk. De hoofdstad is Klagenfurt, wat tevens de grootste stad van de deelstaat is