Albanië
type: Thing
type: Concept
main entity of page: https://data.bibliotheken.nl/.well-known/genid/159f869bbf6976b5413100b7c465abf9
in scheme: brinkman
related match: (496.5)
scope note: Albanië (Albanees: Shqipëria of Shqipnija), officieel de Republiek Albanië (Republika e Shqipërisë), is een republiek in het westen van het Balkanschiereiland