Herwijnen
type: Thing
type: Concept
main entity of page: https://data.bibliotheken.nl/.well-known/genid/ae92478ccdf362bc50f898d16903872c
broader: p075638703
in scheme: brinkman
scope note: dorp in de gemeente Lingewaal, provincie Gelderland