Geul
type: Thing
type: Concept
main entity of page: https://data.bibliotheken.nl/.well-known/genid/975a727313c935146b78fedd58bdbd54
in scheme: brinkman
scope note: De Geul (Duits: Göhl, Frans: Gueule, Oude benamingen: Gullo (922), Guel en Goel (15e eeuw) en Gule) is een rivier die ontspringt in de gemeente Raeren in België nabij de Cycloopstenen aan de Duitse grens nabij de plaats Lichtenbusch. Ze verlaat België bij Sippenaeken en komt bij Cottessen Nederland binnen. Bij het gehucht Voulwames boven Itteren mondt ze uit in de Maas