Korea
type: Thing
type: Concept
main entity of page: https://data.bibliotheken.nl/.well-known/genid/8430e0573e71ecb7b8f7038f632a8a8e
in scheme: brinkman
related match: (519)
scope note: Korea is een voormalige staat in Oost-Azië, bestaande uit een schiereiland, dat aan China en Rusland grenst, en van Japan gescheiden is door de Japanse Zee (in Korea Oostzee genoemd