Scherpenzeel (Gld)
type: Thing
type: Concept
main entity of page: https://data.bibliotheken.nl/.well-known/genid/eecb3920ea2fda8190fb1e2038ce9acd
broader: p075638703
in scheme: brinkman
scope note: LET OP!! er is ook een Scherpenzeel in Friesland!!!!!!!!