Hawaï
type: Thing
type: Concept
main entity of page: https://data.bibliotheken.nl/.well-known/genid/2ddc3a6fb6b150d3464257cc3d060045
alternative label: Hawaii
broader: p075677628
in scheme: brinkman
related match: (799)
scope note: Hawaï of Hawaii (Engels: Hawaii, Hawaïaans: Hawaiʻi) is de vijftigste staat van de staten van de Verenigde Staten