Boven-Volta
type: Thing
type: Concept
main entity of page: https://data.bibliotheken.nl/.well-known/genid/ca02a2fd6d9f0e0a441d5e78042f77b1
alternative label: Opper-Volta
in scheme: brinkman
related: p089481925
related match: (662)
scope note: Opper-Volta, ook wel Boven-Volta, officieel de Republiek Opper-Volta, is de oude naam van het huidige Burkina Faso.