Picardië
type: Thing
type: Concept
main entity of page: https://data.bibliotheken.nl/.well-known/genid/0bf957169ca4642c73da03f1f50c891b
broader: p07563080X
in scheme: brinkman
scope note: Picardië (Frans: Picardie) is een regio in Noord-Frankrijk, noordoostelijk van Haute-Normandie