Nieuw-Guinea
type: Thing
type: Concept
main entity of page: https://data.bibliotheken.nl/.well-known/genid/65ca335711943f4c8024fd9ca6cbb718
broader: p106981501
broader: p075631245
in scheme: brinkman
related: p07564004X
related: p245919317
scope note: Staatkundig gezien is het verdeeld over twee landen; het westelijk deel hoort bij Indonesië en omvat de provincies Papoea en West-Papoea en het oostelijk deel vormt het merendeel van Papoea-Nieuw-Guinea.
scope note: Nieuw-Guinea is een eiland in het westen van de Grote Oceaan dat behoort tot het continent Australië