Italië
type: Thing
type: Concept
main entity of page: https://data.bibliotheken.nl/.well-known/genid/400d94d94bd2501816a0f45c12fc20d0
in scheme: brinkman
related match: (450)
scope note: Italië, officieel de Italiaanse Republiek (Italiaans: Repubblica Italiana), is een land in Zuid-Europa