Zwitserland
type: Thing
type: Concept
main entity of page: https://data.bibliotheken.nl/.well-known/genid/2fa1308a17e1fc3e4c60732d2e3697ca
in scheme: brinkman
related match: (494)
scope note: Zwitserland (Duits: die Schweiz, Frans: la Suisse, Italiaans: la Svizzera, Reto-Romaans: Svizra, Latijn: Helvetia), officieel de Zwitserse Bondsstaat (ook wel Zwitsers Eedgenootschap of Zwitserse Confederatie) (Duits: Schweizerische Eidgenossenschaft, Frans: Confédération suisse, Italiaans: Confederazione Svizzera, Reto-Romaans: Confederaziun svizra, Latijn: Confoederatio Helvetica) is een land in het midden van Europa