Zuid-Korea
type: Thing
type: Concept
main entity of page: https://data.bibliotheken.nl/.well-known/genid/47cb2928c8b4a5912a1f200486cf0baa
alternative label: Hanguk
in scheme: brinkman
related: p075644754
related match: (519.5)
scope note: Zuid-Korea, officieel de Republiek Korea (Koreaans: Daehan Minguk), is een land in het noordoostelijke deel van het Aziatische continent op het zuidelijk deel van het Koreaans Schiereiland dat na de splitsing van het land Korea in 1945 officieel bekend werd als de Republiek Korea