Son en Breugel
type: Thing
type: Concept
main entity of page: https://data.bibliotheken.nl/.well-known/genid/004c49f7411e9aa700a6e3de3f6100bc
broader: p075632845
in scheme: brinkman
related: p312870566
related: p338443177
related match: (492*5690)
scope note: Wikipedia: Son en Breugel is een gemeente in de provincie Noord-Brabant. De gemeente bestaat uit de kerkdorpen Son en Breugel die op korte afstand tegenover elkaar aan de Dommel liggen.