Verenigd Koninkrijk
type: Thing
type: Concept
main entity of page: https://data.bibliotheken.nl/.well-known/genid/a72088d976bdf2b8a5ba96a5b1510a2d
alternative label: United Kingdom
in scheme: brinkman
related match: (410)
scope note: Het Verenigd Koninkrijk omvat de vroegere koninkrijken Engeland en Schotland en het voormalig prinsdom Wales, alsmede Noord-Ierland en een aantal eilandengroepen