Senegal
type: Concept
type: Thing
main entity of page: https://data.bibliotheken.nl/.well-known/genid/d7f689e5de9062c545937f46cbb0f242
in scheme: brinkman
related match: (663)
scope note: Senegal (Frans: Sénégal), officieel de Republiek Senegal, is een land in Afrika