Portugal
type: Thing
type: Concept
main entity of page: https://data.bibliotheken.nl/.well-known/genid/1385f6fe6c1d04a811661ad647707e9f
in scheme: brinkman
related match: (469)
scope note: Portugal, officieel de Portugese Republiek (Portugees: República Portuguesa), is een land in het zuidwesten van Europa